Target
Virion infectivity factor
Ligand
BDBM272257
Substrate
Meas. Tech.
HIV Integrase Inhibitory Assay
Temperature
298.15±n/a K
IC50
6.10±n/a nM
Comments
extracted
Citation
 Miyazaki, SBessho, YAdachi, KKawashita, SIsoshima, HOshita, KFukuda, S Substituted thiazoles as HIV integrase inhibitors US Patent  US10065950 Publication Date 9/4/2018 
Target
Name:
Virion infectivity factor
Synonyms:
HIV integrase VIF_HV1N5 inhibitory activity | vif
Type:
Enzyme Catalytic Domain
Mol. Mass.:
22719.51
Organism:
Human immunodeficiency virus type 1 group M subtype B (isolate NY5) (HIV-1)
Description:
P12504
Residue:
192
  
Inhibitor
Name:
BDBM272257
Synonyms:
US10065950, Example 99
Type:
Small organic molecule
Emp. Form.:
C22H22F2N4O4S
Mol. Mass.:
476.496
SMILES:
COC[C@@H]1Cn2cc(-c3nnc(Cc4ccc(F)cc4F)s3)c(=O)c(O)c2C(=O)N1C(C)C
: