Target
5-hydroxytryptamine receptor 5B
Ligand
BDBM50010301
Substrate
Ki
1000±n/a nM
Comments
PDSP_1725
Citation
 Erlander, MGLovenberg, TWBaron, BMde Lecea, LDanielson, PERacke, MSlone, ALSiegel, BWFoye, PECannon, K Two members of a distinct subfamily of 5-hydroxytryptamine receptors differentially expressed in rat brain. Proc Natl Acad Sci U S A 90:3452-6 (1993)  
Target
Name:
5-hydroxytryptamine receptor 5B
Synonyms:
5-HT5B 5HT5B_RAT Htr5b Serotonin 5b (5-HT5b) receptor
Type:
Enzyme Catalytic Domain
Mol. Mass.:
41141.95
Organism:
RAT
Description:
5-HT5B 0 RAT::P35365
Residue:
370
  
Inhibitor
Name:
BDBM50010301
Synonyms:
8-Bromo-3-methyl-5-phenyl-2,3,4,5-tetrahydro-1H-benzo[d]azepin-7-ol(SKF 83566) SKF 83566
Type:
Small organic molecule
Emp. Form.:
C17H18BrNO
Mol. Mass.:
332.235
SMILES:
CN1CCc2cc(Br)c(O)cc2C(C1)c1ccccc1
: