Target
Muscarinic acetylcholine receptor M3
Ligand
BDBM81799
Substrate
Ki
3.98±n/a nM
Comments
PDSP_931
Citation
 Lazareno, SBuckley, NJRoberts, FF Characterization of muscarinic M4 binding sites in rabbit lung, chicken heart, and NG108-15 cells. Mol Pharmacol 38:805-15 (1990) Target
Name:
Muscarinic acetylcholine receptor M3
Synonyms:
ACM3_RAT Chrm-3 | Chrm3
Type:
Enzyme Catalytic Domain
Mol. Mass.:
66086.66
Organism:
RAT
Description:
Cholinergic, muscarinic M3 CHRM3 RAT::P08483
Residue:
589
  
Inhibitor
Name:
BDBM81799
Synonyms:
CAS_98299-40-2 NSC_3602 | hexahydrosiladifenidol
Type:
Small organic molecule
Emp. Form.:
C20H33NOSi
Mol. Mass.:
331.5676
SMILES:
O[Si](CCCN1CCCCC1)(C1CCCCC1)c1ccccc1
: