Target
Muscarinic acetylcholine receptor
Ligand
BDBM50176065
Substrate
Ki
1.41±n/a nM
Comments
PDSP_111
Citation
 Lazareno, SBuckley, NJRoberts, FF Characterization of muscarinic M4 binding sites in rabbit lung, chicken heart, and NG108-15 cells. Mol Pharmacol 38:805-15 (1990) Target
Name:
Muscarinic acetylcholine receptor
Synonyms:
CHRM4 | Cholinergic, muscarinic M4
Type:
Enzyme Catalytic Domain
Mol. Mass.:
53017.26
Organism:
RABBIT
Description:
Cholinergic, muscarinic M4 CHRM4 RABBIT::PPPPPP
Residue:
478
  
Inhibitor
Name:
BDBM50176065
Synonyms:
4-DAMP Acetic acid 4-[(4-acetoxy-phenyl)-pyridin-2-yl-methyl]-phenyl ester CHEMBL76897
Type:
Small organic molecule
Emp. Form.:
C21H26NO2
Mol. Mass.:
324.4361
SMILES:
C[N+]1(C)CCC(CC1)OC(=O)C(c1ccccc1)c1ccccc1
: