Target
Muscarinic acetylcholine receptor
Ligand
BDBM50071173
Substrate
Ki
6.17±n/a nM
Comments
PDSP_933
Citation
 Lazareno, SBuckley, NJRoberts, FF Characterization of muscarinic M4 binding sites in rabbit lung, chicken heart, and NG108-15 cells. Mol Pharmacol 38:805-15 (1990) Target
Name:
Muscarinic acetylcholine receptor
Synonyms:
CHRM4 | Cholinergic, muscarinic M4
Type:
Enzyme Catalytic Domain
Mol. Mass.:
53017.26
Organism:
RABBIT
Description:
Cholinergic, muscarinic M4 CHRM4 RABBIT::PPPPPP
Residue:
478
  
Inhibitor
Name:
BDBM50071173
Synonyms:
(3R,4R,4aS,8aR)-4-[(E)-2-((2S,6S)-1,6-Dimethyl-piperidin-2-yl)-vinyl]-3-methyl-decahydro-naphtho[2,3-c]furan-1-one HIMBACINE
Type:
Small organic molecule
Emp. Form.:
C22H35NO2
Mol. Mass.:
345.5188
SMILES:
C[C@H]1OC(=O)C2C[C@H]3CCCC[C@@H]3[C@@H](\C=C\[C@@H]3CCC[C@H](C)N3C)C12
: