Target
Alpha-1A adrenergic receptor
Ligand
BDBM81980
Substrate
Ki
0.45±n/a nM
Comments
PDSP_2059
Citation
 Megens, AALeysen, JEAwouters, FHNiemegeers, CJ Further validation of in vivo and in vitro pharmacological procedures for assessing the alpha 2/alpha 1-selectivity of test compounds: (1). Alpha-adrenoceptor antagonists. Eur J Pharmacol 129:49-55 (1986)  
Target
Name:
Alpha-1A adrenergic receptor
Synonyms:
ADA1A_RAT Adra1c Alpha-1A adrenoceptor Alpha-1C adrenergic receptor | adrenergic Alpha1A
Type:
Protein
Mol. Mass.:
51620.15
Organism:
Rattus norvegicus (Rat)
Description:
P43140
Residue:
466
  
Inhibitor
Name:
BDBM81980
Synonyms:
Butanserin NSC_65652
Type:
Small organic molecule
Emp. Form.:
C24H26FN3O3
Mol. Mass.:
423.4799
SMILES:
Fc1ccc(cc1)C(=O)C1CCN(CCCCn2c(=O)[nH]c3ccccc3c2=O)CC1
: