Target
GABA(A) receptor-associated protein
Ligand
BDBM82387
Substrate
Ki
7800±n/a nM
Comments
PDSP_48
Citation
 Evans, BEBock, MGRittle, KEDiPardo, RMWhitter, WLVeber, DFAnderson, PSFreidinger, RM Design of potent, orally effective, nonpeptidal antagonists of the peptide hormone cholecystokinin. Proc Natl Acad Sci U S A 83:4918-22 (1986)  
Target
Name:
GABA(A) receptor-associated protein
Synonyms:
GABA A Benzodiazepine | GABA-A receptor subunit alpha 1
Type:
Enzyme Catalytic Domain
Mol. Mass.:
13921.89
Organism:
GUINEA PIG
Description:
D7RA28
Residue:
117
  
Inhibitor
Name:
BDBM82387
Synonyms:
CCK antagonist synthetic 22
Type:
Emp. Form.:
C25H19FN4O2
Mol. Mass.:
426.4424
SMILES:
CN1c2ccc(F)cc2C(=NC(NC(=O)c2cc3ccccc3[nH]2)C1=O)c1ccccc1
: