Target
Alpha-1B adrenergic receptor
Ligand
BDBM50033112
Substrate
Ki
180±n/a nM
Comments
PDSP_181
Citation
 Horie, KHirasawa, ATsujimoto, G The pharmacological profile of cloned and stably expressed alpha 1b-adrenoceptor in CHO cells. Eur J Pharmacol 268:399-407 (1994)  
Target
Name:
Alpha-1B adrenergic receptor
Synonyms:
ADA1B_MESAU Adrenergic receptor alpha adrenergic Alpha1B
Type:
Enzyme Catalytic Domain
Mol. Mass.:
56514.13
Organism:
C.H.O.
Description:
adrenergic Alpha1B ADRA1B C.H.O.::P18841
Residue:
515
  
Inhibitor
Name:
BDBM50033112
Synonyms:
6-{3-[4-(2-Methoxy-phenyl)-piperazin-1-yl]-propylamino}-1,3,5-trimethyl-1H-pyrimidine-2,4-dione Urapidil-5-methyl
Type:
Small organic molecule
Emp. Form.:
C21H31N5O3
Mol. Mass.:
401.5025
SMILES:
COc1ccccc1N1CCN(CCCNc2c(C)c(=O)n(C)c(=O)n2C)CC1
: