Target
Muscarinic acetylcholine receptor M5
Ligand
BDBM82423
Substrate
Ki
33.87±n/a nM
Comments
PDSP_1916
Citation
 Maggio, RBarbier, PBolognesi, MLMinarini, ATedeschi, DMelchiorre, C Binding profile of the selective muscarinic receptor antagonist tripitramine. Eur J Pharmacol 268:459-62 (1994)  
Target
Name:
Muscarinic acetylcholine receptor M5
Synonyms:
ACM5_HUMAN | CHRM5
Type:
PROTEIN
Mol. Mass.:
60102.35
Organism:
Homo sapiens (Human)
Description:
ChEMBL_1517990
Residue:
532
  
Inhibitor
Name:
BDBM82423
Synonyms:
CAS_132947 TRIPITRAMINE
Type:
Small organic molecule
Emp. Form.:
C64H77N13O6
Mol. Mass.:
1124.3797
SMILES:
CN(CCCCCCCCN(C)CCCCCCN(CC(=O)N1c2ccccc2C(=O)Nc2cccnc12)CC(=O)N1c2ccccc2C(=O)Nc2cccnc12)CCCCCCNCC(=O)N1c2ccccc2C(=O)Nc2cccnc12
: