Target
Phosphatidylinositol 4,5-bisphosphate 3-kinase catalytic subunit gamma isoform
Ligand
BDBM272657
Substrate
Meas. Tech.
PI3K-gamma Scintillation Proximity Assay
pH
6.7±n/a
Temperature
298.15±n/a K
IC50
<100±n/a nM
Comments
extracted
Citation
 Shvartsbart, AShepard, SCombs, APShao, LFalahatpisheh, NZou, GYue, EWJalluri, RK Heterocyclic compounds as PI3K-γ inhibitors US Patent  US10065963 Publication Date 9/4/2018 
Target
Name:
Phosphatidylinositol 4,5-bisphosphate 3-kinase catalytic subunit gamma isoform
Synonyms:
PI3-kinase p110 subunit gamma PI3Kgamma PK3CG_HUMAN Phosphatidylinositol 4,5-bisphosphate 3-kinase (PI3K) Phosphatidylinositol 4,5-bisphosphate 3-kinase catalytic subunit gamma (PI3Kgamma) Phosphatidylinositol 4,5-bisphosphate 3-kinase catalytic subunit gamma isoform (PI3K) Phosphatidylinositol-4,5-bisphosphate 3-kinase catalytic subunit gamma isoform Phosphoinositide 3-kinases gamma (PI3K gamma) p120-PI3K
Type:
Enzyme Subunit
Mol. Mass.:
126470.30
Organism:
Homo sapiens (Human)
Description:
P48736
Residue:
1102
  
Inhibitor
Name:
BDBM272657
Synonyms:
2-Amino-N-{1-[8-chloro-5-(2,2-dimethylpyrrolidin-1- yl)imidazo[1,5-a]pyridin-6-yl]ethyl}pyrazolo[1,5- a]pyrimidine-3-carboxamide bistrifluoroacetate | US10065963, Example 70
Type:
Small organic molecule
Emp. Form.:
C22H25ClN8O
Mol. Mass.:
452.94
SMILES:
CC(NC(=O)c1c(N)nn2cccnc12)c1cc(Cl)c2cn[nH]c2c1N1CCCC1(C)C
: