Target
Phosphatidylinositol 4,5-bisphosphate 3-kinase catalytic subunit delta isoform
Ligand
BDBM272665
Substrate
Meas. Tech.
PI3K-delta Scintillation Proximity Assay
pH
6.7±n/a
Temperature
298.15±n/a K
IC50
<100±n/a nM
Comments
extracted
Citation
 Shvartsbart, AShepard, SCombs, APShao, LFalahatpisheh, NZou, GYue, EWJalluri, RK Heterocyclic compounds as PI3K-γ inhibitors US Patent  US10065963 Publication Date 9/4/2018 
Target
Name:
Phosphatidylinositol 4,5-bisphosphate 3-kinase catalytic subunit delta isoform
Synonyms:
PI3-kinase p110 subunit delta PI3-kinase subunit p110-delta PIK3CD Phosphatidylinositol 4,5-biphosphate 3-kinase catalytic subunit delta (PIK3CD) Phosphatidylinositol 4,5-bisphosphate 3-kinase 110 kDa catalytic subunit delta (PI3K delta) Phosphatidylinositol 4,5-bisphosphate 3-kinase catalytic subunit delta (PI3Kdelta) Phosphatidylinositol 4,5-bisphosphate 3-kinase catalytic subunit delta isoform (PI3K delta) Phosphatidylinositol 4,5-bisphosphate 3-kinase catalytic subunit delta isoform (PI3K-delta) Phosphatidylinositol 4,5-bisphosphate 3-kinase catalytic subunit delta isoform (PI3Kdelta)
Type:
Enzyme Subunit
Mol. Mass.:
119489.41
Organism:
Homo sapiens (Human)
Description:
O00329
Residue:
1044
  
Inhibitor
Name:
BDBM272665
Synonyms:
2-Amino-N-{1-[8-chloro-5-(3,3-dimethylpyrrolidin-1- yl)imidazo[1,5-a]pyridin-6-yl]ethyl}pyrazolo[1,5- a]pyrimidine-3-carboxamide bistrifluoroacetate | US10065963, Example 74
Type:
Small organic molecule
Emp. Form.:
C22H25ClN8O
Mol. Mass.:
452.94
SMILES:
CC(NC(=O)c1c(N)nn2cccnc12)c1cc(Cl)c2cn[nH]c2c1N1CCC(C)(C)C1
: