Target
Phosphatidylinositol 4,5-bisphosphate 3-kinase catalytic subunit gamma isoform
Ligand
BDBM272721
Substrate
Meas. Tech.
THP-1 RPS6 ELISA Assay
IC50
<500±n/a nM
Citation
 Shvartsbart, AShepard, SCombs, APShao, LFalahatpisheh, NZou, GYue, EWJalluri, RK Heterocyclic compounds as PI3K-γ inhibitors US Patent  US10065963 Publication Date 9/4/2018 
Target
Name:
Phosphatidylinositol 4,5-bisphosphate 3-kinase catalytic subunit gamma isoform
Synonyms:
PI3-kinase p110 subunit gamma PI3Kgamma PK3CG_HUMAN Phosphatidylinositol 4,5-bisphosphate 3-kinase (PI3K) Phosphatidylinositol 4,5-bisphosphate 3-kinase catalytic subunit gamma (PI3Kgamma) Phosphatidylinositol 4,5-bisphosphate 3-kinase catalytic subunit gamma isoform (PI3K) Phosphatidylinositol-4,5-bisphosphate 3-kinase catalytic subunit gamma isoform Phosphoinositide 3-kinases gamma (PI3K gamma) p120-PI3K
Type:
Enzyme Subunit
Mol. Mass.:
126470.30
Organism:
Homo sapiens (Human)
Description:
P48736
Residue:
1102
  
Inhibitor
Name:
BDBM272721
Synonyms:
US10065963, Example 122
Type:
Small organic molecule
Emp. Form.:
C20H17Cl2N9O
Mol. Mass.:
470.315
SMILES:
CC(NC(=O)c1c(N)nn2cccnc12)c1cc(Cl)c2c(Cl)nc(C)n2c1-c1cn[nH]c1
: