Target
Phosphatidylinositol 4,5-bisphosphate 3-kinase catalytic subunit gamma isoform
Ligand
BDBM272754
Substrate
Meas. Tech.
THP-1 RPS6 ELISA Assay
IC50
<500±n/a nM
Citation
 Shvartsbart, AShepard, SCombs, APShao, LFalahatpisheh, NZou, GYue, EWJalluri, RK Heterocyclic compounds as PI3K-γ inhibitors US Patent  US10065963 Publication Date 9/4/2018 
Target
Name:
Phosphatidylinositol 4,5-bisphosphate 3-kinase catalytic subunit gamma isoform
Synonyms:
PI3-kinase p110 subunit gamma PI3Kgamma PK3CG_HUMAN Phosphatidylinositol 4,5-bisphosphate 3-kinase (PI3K) Phosphatidylinositol 4,5-bisphosphate 3-kinase catalytic subunit gamma (PI3Kgamma) Phosphatidylinositol 4,5-bisphosphate 3-kinase catalytic subunit gamma isoform (PI3K) Phosphatidylinositol-4,5-bisphosphate 3-kinase catalytic subunit gamma isoform Phosphoinositide 3-kinases gamma (PI3K gamma) p120-PI3K
Type:
Enzyme Subunit
Mol. Mass.:
126470.30
Organism:
Homo sapiens (Human)
Description:
P48736
Residue:
1102
  
Inhibitor
Name:
BDBM272754
Synonyms:
2-Amino-N-(1-{8-chloro-5-[(3R,5R)-3,5- dihydroxypiperidin-1-yl]imidazo[1,5-a]pyridin-6- yl}ethyl)pyrazolo[1,5-a]pyrimidine-3- carboxamide trifluoroacetate salt (mixture of two diastereomers prepared) | US10065963, Example 155A
Type:
Small organic molecule
Emp. Form.:
C21H23ClN8O3
Mol. Mass.:
470.912
SMILES:
C[C@@H](NC(=O)c1c(N)nn2cccnc12)c1cc(Cl)c2cncn2c1N1C[C@H](O)C[C@@H](O)C1
: