Target
Alpha-1B adrenergic receptor
Ligand
BDBM31046
Substrate
Ki
79.43±n/a nM
Comments
PDSP_1479
Citation
 Schwinn, DAJohnston, GIPage, SOMosley, MJWilson, KHWorman, NPCampbell, SFidock, MDFurness, LMParry-Smith, DJ Cloning and pharmacological characterization of human alpha-1 adrenergic receptors: sequence corrections and direct comparison with other species homologues. J Pharmacol Exp Ther 272:134-42 (1995) Target
Name:
Alpha-1B adrenergic receptor
Synonyms:
ADA1B_MESAU adrenergic Alpha1
Type:
Enzyme Catalytic Domain
Mol. Mass.:
56514.13
Organism:
HAMSTER
Description:
adrenergic Alpha1 0 HAMSTER::P18841
Residue:
515
  
Inhibitor
Name:
BDBM31046
Synonyms:
3-[4,5-dihydro-1H-imidazol-2-ylmethyl-(4-methylphenyl)amino]phenol;methanesulfonic acid 3-[N-(2-imidazolin-2-ylmethyl)-4-methyl-anilino]phenol;mesylic acid MLS000069487 PHENTOLAMINE MESYLATE cid_5775 | cid_91430
Type:
Small organic molecule
Emp. Form.:
C17H19N3O
Mol. Mass.:
281.3523
SMILES:
Cc1ccc(cc1)N(CC1=NCCN1)c1cccc(O)c1
: