Target
Alpha-1A adrenergic receptor
Ligand
BDBM29568
Substrate
Ki
0.31±n/a nM
Comments
PDSP_1528
Citation
 Schwinn, DAJohnston, GIPage, SOMosley, MJWilson, KHWorman, NPCampbell, SFidock, MDFurness, LMParry-Smith, DJ Cloning and pharmacological characterization of human alpha-1 adrenergic receptors: sequence corrections and direct comparison with other species homologues. J Pharmacol Exp Ther 272:134-42 (1995) Target
Name:
Alpha-1A adrenergic receptor
Synonyms:
ADA1A_HUMAN ADRA1C Alpha 1A-adrenoceptor Alpha adrenergic receptor 1a Alpha-adrenergic receptor 1c adrenergic Alpha1 | adrenergic Alpha1C
Type:
Cell-surface receptors
Mol. Mass.:
51511.67
Organism:
Homo sapiens (Human)
Description:
P35348
Residue:
466
  
Inhibitor
Name:
BDBM29568
Synonyms:
CHEMBL2 PRAZOSIN HYDROCHLORIDE [3H]-Minipress [3H]-Prazosin
Type:
radiolabeled ligand
Emp. Form.:
C19H21N5O4
Mol. Mass.:
383.4011
SMILES:
COc1cc2nc(nc(N)c2cc1OC)N1CCN(CC1)C(=O)c1ccco1
: