Target
Mu-type opioid receptor
Ligand
BDBM50013388
Substrate
Ki
1.4±n/a nM
Comments
PDSP_413
Citation
 Raynor, KKong, HMestek, ABye, LSTian, MLiu, JYu, LReisine, T Characterization of the cloned human mu opioid receptor. J Pharmacol Exp Ther 272:423-8 (1995) Target
Name:
Mu-type opioid receptor
Synonyms:
M-OR-1 MOR-1 MUOR1 Mu opiate receptor OPRM1 hMOP | mu-type opioid receptor isoform MOR-1
Type:
G Protein-Coupled Receptor (GPCR)
Mol. Mass.:
44789.51
Organism:
Homo sapiens (Human)
Description:
P35372
Residue:
400
  
Inhibitor
Name:
BDBM50013388
Synonyms:
6-Ethyl-3-(1-hydroxy-cyclopropylmethyl)-11,11-dimethyl-1,2,3,4,5,6-hexahydro-2,6-methano-benzo[d]azocin-8-ol Bremazocine | CHEMBL350384
Type:
Small organic molecule
Emp. Form.:
C20H29NO2
Mol. Mass.:
315.4498
SMILES:
CCC12CCN(CC3(O)CC3)C(Cc3ccc(O)cc13)C2(C)C
: