Target
Mu-type opioid receptor
Ligand
BDBM82266
Substrate
Ki
65±n/a nM
Comments
PDSP_557
Citation
 Raynor, KKong, HMestek, ABye, LSTian, MLiu, JYu, LReisine, T Characterization of the cloned human mu opioid receptor. J Pharmacol Exp Ther 272:423-8 (1995) Target
Name:
Mu-type opioid receptor
Synonyms:
M-OR-1 MOR-1 MUOR1 Mu opiate receptor OPRM1 hMOP | mu-type opioid receptor isoform MOR-1
Type:
G Protein-Coupled Receptor (GPCR)
Mol. Mass.:
44789.51
Organism:
Homo sapiens (Human)
Description:
P35372
Residue:
400
  
Inhibitor
Name:
BDBM82266
Synonyms:
CAS_29485-83-4 Codeine | NSC_223652
Type:
Small organic molecule
Emp. Form.:
C18H21NO3
Mol. Mass.:
299.3642
SMILES:
COc1ccc2CC3C4C=CC(O)C5Oc1c2C45CCN3C
: