Target
Mu-type opioid receptor
Ligand
BDBM50019574
Substrate
Ki
3.9±n/a nM
Comments
PDSP_592
Citation
 Raynor, KKong, HMestek, ABye, LSTian, MLiu, JYu, LReisine, T Characterization of the cloned human mu opioid receptor. J Pharmacol Exp Ther 272:423-8 (1995) Target
Name:
Mu-type opioid receptor
Synonyms:
M-OR-1 MOR-1 MUOR1 Mu opiate receptor OPRM1 hMOP | mu-type opioid receptor isoform MOR-1
Type:
G Protein-Coupled Receptor (GPCR)
Mol. Mass.:
44789.51
Organism:
Homo sapiens (Human)
Description:
P35372
Residue:
400
  
Inhibitor
Name:
BDBM50019574
Synonyms:
CHEMBL406014 D-Phe-Cys-Tyr-D-Trp-Orn-Thr-Pen-Thr-NH2(CTOP)
Type:
Small organic molecule
Emp. Form.:
C50H67N11O11S2
Mol. Mass.:
1062.264
SMILES:
C[C@@H](O)[C@H](NC(=O)[C@@H]1NC(=O)[C@H](NC(=O)[C@H](CCCN)NC(=O)[C@@H](Cc2c[nH]c3ccccc23)NC(=O)[C@H](Cc2ccc(O)cc2)NC(=O)[C@H](CSSC1(C)C)NC(=O)[C@H](N)Cc1ccccc1)[C@@H](C)O)C(N)=O
: