Target
Type-2 angiotensin II receptor
Ligand
BDBM50006909
Substrate
Ki
0.89±n/a nM
Comments
PDSP_809
Citation
 Beauchamp, HTChang, RSSiegl, PKGibson, RE In vivo receptor occupancy of the angiotensin II receptor by nonpeptide antagonists: relationship to in vitro affinities and in vivo pharmacologic potency. J Pharmacol Exp Ther 272:612-8 (1995) Target
Name:
Type-2 angiotensin II receptor
Synonyms:
AGTR2_RAT Agtr2 Angiotensin II receptor Type-2 angiotensin II receptor
Type:
Enzyme Catalytic Domain
Mol. Mass.:
41346.62
Organism:
RAT
Description:
Angiotensin II AT2 0 0::P35351
Residue:
363
  
Inhibitor
Name:
BDBM50006909
Synonyms:
2-Butyl-5-chloro-3-[2'-(1H-tetrazol-5-yl)-biphenyl-4-ylmethyl]-3H-imidazole-4-carboxylic acid 2-Butyl-5-chloro-3-[2'-(2H-tetrazol-5-yl)-biphenyl-4-ylmethyl]-3H-imidazole-4-carboxylic acid CHEMBL907 E 3174 | EXP3174
Type:
Small organic molecule
Emp. Form.:
C22H21ClN6O2
Mol. Mass.:
436.894
SMILES:
CCCCc1nc(Cl)c(C(O)=O)n1Cc1ccc(cc1)-c1ccccc1-c1nnn[nH]1
: