Target
Type-2 angiotensin II receptor
Ligand
BDBM82433
Substrate
Ki
0.84±n/a nM
Comments
PDSP_1021
Citation
 Beauchamp, HTChang, RSSiegl, PKGibson, RE In vivo receptor occupancy of the angiotensin II receptor by nonpeptide antagonists: relationship to in vitro affinities and in vivo pharmacologic potency. J Pharmacol Exp Ther 272:612-8 (1995) Target
Name:
Type-2 angiotensin II receptor
Synonyms:
AGTR2_RAT Agtr2 Angiotensin II receptor Type-2 angiotensin II receptor
Type:
Enzyme Catalytic Domain
Mol. Mass.:
41346.62
Organism:
RAT
Description:
Angiotensin II AT2 0 0::P35351
Residue:
363
  
Inhibitor
Name:
BDBM82433
Synonyms:
CHEMBL302102 L-159689 | N-Pentyl-N-[[2-propyl-3-[[2'-(1H-tetrazol-5-yl)biphenyl-4-yl]methyl]-3,4-dihydro-4-oxoquinazolin]-6-yl]benzamide
Type:
Small organic molecule
Emp. Form.:
C37H37N7O2
Mol. Mass.:
611.7354
SMILES:
CCCCCN(C(=O)c1ccccc1)c1ccc2nc(CCC)n(Cc3ccc(cc3)-c3ccccc3-c3nnn[nH]3)c(=O)c2c1
: