Target
Type-2 angiotensin II receptor
Ligand
BDBM50042746
Substrate
Ki
0.8±n/a nM
Comments
PDSP_1022
Citation
 Beauchamp, HTChang, RSSiegl, PKGibson, RE In vivo receptor occupancy of the angiotensin II receptor by nonpeptide antagonists: relationship to in vitro affinities and in vivo pharmacologic potency. J Pharmacol Exp Ther 272:612-8 (1995) Target
Name:
Type-2 angiotensin II receptor
Synonyms:
AGTR2_RAT Agtr2 Angiotensin II receptor Type-2 angiotensin II receptor
Type:
Enzyme Catalytic Domain
Mol. Mass.:
41346.62
Organism:
RAT
Description:
Angiotensin II AT2 0 0::P35351
Residue:
363
  
Inhibitor
Name:
BDBM50042746
Synonyms:
CHEMBL122212 [4-(2-Ethyl-5,7-dimethyl-imidazo[4,5-b]pyridin-3-ylmethyl)-2,6-dipropyl-phenoxy]-phenyl-acetic acid
Type:
Small organic molecule
Emp. Form.:
C31H37N3O3
Mol. Mass.:
499.6438
SMILES:
CCCc1cc(Cn2c(CC)nc3c(C)cc(C)nc23)cc(CCC)c1OC(C(O)=O)c1ccccc1
: