Target
Type-2 angiotensin II receptor
Ligand
BDBM82436
Substrate
Ki
0.72±n/a nM
Comments
PDSP_1024
Citation
 Beauchamp, HTChang, RSSiegl, PKGibson, RE In vivo receptor occupancy of the angiotensin II receptor by nonpeptide antagonists: relationship to in vitro affinities and in vivo pharmacologic potency. J Pharmacol Exp Ther 272:612-8 (1995) Target
Name:
Type-2 angiotensin II receptor
Synonyms:
AGTR2_RAT Agtr2 Angiotensin II receptor Type-2 angiotensin II receptor
Type:
Enzyme Catalytic Domain
Mol. Mass.:
41346.62
Organism:
RAT
Description:
Angiotensin II AT2 0 0::P35351
Residue:
363
  
Inhibitor
Name:
BDBM82436
Synonyms:
1-(2,6-Dichlorophenyl)-4-[[2'-(1H-tetrazol-5-yl)biphenyl-4-yl]methyl]-3-propyl-1H-pyrazole-5-carboxylic acid L-161274
Type:
Small organic molecule
Emp. Form.:
C27H22Cl2N6O2
Mol. Mass.:
533.409
SMILES:
CCCc1nn(c(C(O)=O)c1Cc1ccc(cc1)-c1ccccc1-c1nnn[nH]1)-c1c(Cl)cccc1Cl
: