Target
Type-2 angiotensin II receptor
Ligand
BDBM82431
Substrate
Ki
51.6±n/a nM
Comments
PDSP_1029
Citation
 Beauchamp, HTChang, RSSiegl, PKGibson, RE In vivo receptor occupancy of the angiotensin II receptor by nonpeptide antagonists: relationship to in vitro affinities and in vivo pharmacologic potency. J Pharmacol Exp Ther 272:612-8 (1995) Target
Name:
Type-2 angiotensin II receptor
Synonyms:
AGTR2_RAT Agtr2 Angiotensin II receptor Type-2 angiotensin II receptor
Type:
Enzyme Catalytic Domain
Mol. Mass.:
41346.62
Organism:
RAT
Description:
Angiotensin II AT2 0 0::P35351
Residue:
363
  
Inhibitor
Name:
BDBM82431
Synonyms:
L-162,193 N-[[4-[[[6-[4-(Cyclopropylcarbonyl)-1-piperazinyl]-2-butyl-3,4-dihydro-4-oxoquinazolin]-3-yl]methyl]biphenyl-2'-yl]sulfonyl]carbamic acid butyl ester
Type:
Small organic molecule
Emp. Form.:
C38H45N5O6S
Mol. Mass.:
699.859
SMILES:
[#6]-[#6]-[#6]-[#6]-[#8]-[#6](=O)-[#7][S;v6](=O)(=O)c1ccccc1-c1ccc(-[#6]-n2c(-[#6]-[#6]-[#6]-[#6])nc3ccc(cc3c2=O)-[#7]-2-[#6]-[#6]-[#7](-[#6]-[#6]-2)-[#6](=O)-[#6]-2-[#6]-[#6]-2)cc1
: