Target
5-hydroxytryptamine receptor 1A
Ligand
BDBM82439
Substrate
Ki
>10000±n/a nM
Comments
PDSP_237
Citation
 Cusack, BNelson, ARichelson, E Binding of antidepressants to human brain receptors: focus on newer generation compounds. Psychopharmacology (Berl) 114:559-65 (1994)  
Target
Name:
5-hydroxytryptamine receptor 1A
Synonyms:
5-HT-1A 5-hydroxytryptamine receptor 1A (5-HT-1A) ADRB2RL1 Dopamine D2 receptor and serotonin 1a receptor HTR1A | Serotonin receptor 1A
Type:
Mol. Mass.:
46122.49
Organism:
Homo sapiens (Human)
Description:
Residue:
422
  
Inhibitor
Name:
BDBM82439
Synonyms:
Adinazolam NSC_37632
Type:
Small organic molecule
Emp. Form.:
C19H18ClN5
Mol. Mass.:
351.833
SMILES:
CN(C)Cc1nnc2CN=C(c3ccccc3)c3cc(Cl)ccc3-n12
: