Target
Alpha-1A adrenergic receptor
Ligand
BDBM82439
Substrate
Ki
>10000±n/a nM
Comments
PDSP_237
Citation
 Cusack, BNelson, ARichelson, E Binding of antidepressants to human brain receptors: focus on newer generation compounds. Psychopharmacology (Berl) 114:559-65 (1994)  
Target
Name:
Alpha-1A adrenergic receptor
Synonyms:
ADA1A_HUMAN ADRA1C Alpha 1A-adrenoceptor Alpha adrenergic receptor 1a Alpha-adrenergic receptor 1c adrenergic Alpha1 | adrenergic Alpha1C
Type:
Cell-surface receptors
Mol. Mass.:
51511.67
Organism:
Homo sapiens (Human)
Description:
P35348
Residue:
466
  
Inhibitor
Name:
BDBM82439
Synonyms:
Adinazolam NSC_37632
Type:
Small organic molecule
Emp. Form.:
C19H18ClN5
Mol. Mass.:
351.833
SMILES:
CN(C)Cc1nnc2CN=C(c3ccccc3)c3cc(Cl)ccc3-n12
: