Target
Alpha-2A adrenergic receptor
Ligand
BDBM82437
Substrate
Ki
2700±n/a nM
Comments
PDSP_1088
Citation
 Cusack, BNelson, ARichelson, E Binding of antidepressants to human brain receptors: focus on newer generation compounds. Psychopharmacology (Berl) 114:559-65 (1994)  
Target
Name:
Alpha-2A adrenergic receptor
Synonyms:
ADA2A_HUMAN ADRA2R Adrenergic alpha2A Alpha-2 adrenergic receptor subtype C10 Alpha-2A adrenoreceptor alpha-2A adrenergic receptor [Homo sapiens]
Type:
Enzyme
Mol. Mass.:
48979.91
Organism:
Homo sapiens (Human)
Description:
P08913
Residue:
450
  
Inhibitor
Name:
BDBM82437
Synonyms:
CAS_23047-25-8 NSC_3947 | US8629135, SW-06
Type:
Small organic molecule
Emp. Form.:
C26H27ClN2O
Mol. Mass.:
418.958
SMILES:
CN(CCCN1c2ccccc2CCc2ccccc12)CC(=O)c1ccc(Cl)cc1
: