Target
Histamine H1 receptor
Ligand
BDBM50014247
Substrate
Ki
4200±n/a nM
Comments
PDSP_811
Citation
 Cusack, BNelson, ARichelson, E Binding of antidepressants to human brain receptors: focus on newer generation compounds. Psychopharmacology (Berl) 114:559-65 (1994)  
Target
Name:
Histamine H1 receptor
Synonyms:
H1R HISTAMINE H1 HRH1_HUMAN
Type:
G Protein-Coupled Receptor (GPCR)
Mol. Mass.:
55808.72
Organism:
Homo sapiens (Human)
Description:
Cell pellets from SK-N-MC cells transfected with human H1 receptor were used in binding assay.
Residue:
487
  
Inhibitor
Name:
BDBM50014247
Synonyms:
(3R,4S)-3-(4-Methoxy-phenoxymethyl)-1-methyl-4-phenyl-piperidine CHEMBL94739 | Femoxetine
Type:
Small organic molecule
Emp. Form.:
C20H25NO2
Mol. Mass.:
311.418
SMILES:
COc1ccc(OC[C@H]2CN(C)CC[C@@H]2c2ccccc2)cc1
: