Target
Somatostatin receptor type 1
Ligand
BDBM82457
Substrate
Ki
1000±n/a nM
Comments
PDSP_1032
Citation
 Hoyer, DLübbert, HBruns, C Molecular pharmacology of somatostatin receptors. Naunyn Schmiedebergs Arch Pharmacol 350:441-53 (1994)  
Target
Name:
Somatostatin receptor type 1
Synonyms:
SOMATOSTATIN SST1 SS-1-R SS1R SSTR1 | Somatostatin receptor type 1 (SSTR1)
Type:
Enzyme
Mol. Mass.:
42692.81
Organism:
Homo sapiens (Human)
Description:
P30872
Residue:
391
  
Inhibitor
Name:
BDBM82457
Synonyms:
(1R,4S,7S,10R,13S,16R)-4-[(R)-1-Hydroxyethyl]-7-(4-aminobutyl)-10-(1H-indole-3-ylmethyl)-13-benzyl-28,29-dithia-2,5,8,11,14,17,25-heptaazabicyclo[14.10.4]triacontane-3,6,9,12,15,18,26-heptone | L-362,823
Type:
Small organic molecule
Emp. Form.:
C43H59N9O8S2
Mol. Mass.:
894.114
SMILES:
C[C@@H](O)[C@@H]1NC(=O)[C@H](CCCCN)NC(=O)[C@@H](Cc2c[nH]c3ccccc23)NC(=O)[C@H](Cc2ccccc2)NC(=O)[C@@H]2CSSC[C@H](NC1=O)C(=O)NCCCCCCC(=O)N2
: