Target
Somatostatin receptor type 5
Ligand
BDBM82464
Substrate
Ki
1.58±n/a nM
Comments
PDSP_1591
Citation
 Hoyer, DLübbert, HBruns, C Molecular pharmacology of somatostatin receptors. Naunyn Schmiedebergs Arch Pharmacol 350:441-53 (1994)  
Target
Name:
Somatostatin receptor type 5
Synonyms:
SOMATOSTATIN SST5 Somatostatin receptor Sstr5
Type:
Enzyme Catalytic Domain
Mol. Mass.:
39986.50
Organism:
RAT
Description:
SOMATOSTATIN SST5 SSTR5 RAT::P30938
Residue:
363
  
Inhibitor
Name:
BDBM82464
Synonyms:
CAS_71306 RC 160 | Vapreotide
Type:
Small organic molecule
Emp. Form.:
C57H70N12O9S2
Mol. Mass.:
1131.371
SMILES:
CC(C)C1NC(=O)C(CCCCN)NC(=O)C(Cc2c[nH]c3ccccc23)NC(=O)C(Cc2ccc(O)cc2)NC(=O)C(CSSCC(NC1=O)C(=O)NC(Cc1c[nH]c2ccccc12)C(N)=O)NC(=O)C(N)Cc1ccccc1
: