Target
5-hydroxytryptamine receptor 6
Ligand
BDBM50007692
Substrate
Ki
74±n/a nM
Comments
PDSP_1858
Citation
 Roth, BLCraigo, SCChoudhary, MSUluer, AMonsma, FJShen, YMeltzer, HYSibley, DR Binding of typical and atypical antipsychotic agents to 5-hydroxytryptamine-6 and 5-hydroxytryptamine-7 receptors. J Pharmacol Exp Ther 268:1403-10 (1994) Target
Name:
5-hydroxytryptamine receptor 6
Synonyms:
5-HT-6 5-hydroxytryptamine receptor 6 Htr6 Serotonin (5-HT) receptor Serotonin receptor 6
Type:
Enzyme Catalytic Domain
Mol. Mass.:
46945.51
Organism:
RAT
Description:
5-HT6 HTR6 RAT::P31388
Residue:
436
  
Inhibitor
Name:
BDBM50007692
Synonyms:
8-[4-(4-Benzo[d]isothiazol-3-yl-piperazin-1-yl)-butyl]-8-aza-spiro[4.5]decane-7,9-dione CHEMBL35057 | TIOSPERONE
Type:
Small organic molecule
Emp. Form.:
C24H32N4O2S
Mol. Mass.:
440.601
SMILES:
O=C1CC2(CCCC2)CC(=O)N1CCCCN1CCN(CC1)c1nsc2ccccc12
: