Target
Beta-1 adrenergic receptor
Ligand
BDBM25392
Substrate
Ki
467.73±n/a nM
Comments
PDSP_993
Citation
 Fraundorfer, PFFertel, RHMiller, DDFeller, DR Biochemical and pharmacological characterization of high-affinity trimetoquinol analogs on guinea pig and human beta adrenergic receptor subtypes: evidence for partial agonism. J Pharmacol Exp Ther 270:665-74 (1994) Target
Name:
Beta-1 adrenergic receptor
Synonyms:
ADRB1 adrenergic Beta1
Type:
Enzyme Catalytic Domain
Mol. Mass.:
50540.48
Organism:
GUINEA PIG
Description:
adrenergic Beta1 ADRB1 GUINEA PIG::B0FL73
Residue:
467
  
Inhibitor
Name:
BDBM25392
Synonyms:
4-[1-hydroxy-2-(isopropylamino)ethyl]pyrocatechol;hydrochloride 4-{1-hydroxy-2-[(propan-2-yl)amino]ethyl}benzene-1,2-diol, 2 ISOPROTERONOL Isoproterenol Isoproterenol,(+) Norisodrine | Novodrin
Type:
Small organic molecule
Emp. Form.:
C11H17NO3
Mol. Mass.:
211.2576
SMILES:
CC(C)NCC(O)c1ccc(O)c(O)c1
: