Target
Beta-1 adrenergic receptor
Ligand
BDBM82504
Substrate
Ki
1096.47±n/a nM
Comments
PDSP_1876
Citation
 Fraundorfer, PFFertel, RHMiller, DDFeller, DR Biochemical and pharmacological characterization of high-affinity trimetoquinol analogs on guinea pig and human beta adrenergic receptor subtypes: evidence for partial agonism. J Pharmacol Exp Ther 270:665-74 (1994) Target
Name:
Beta-1 adrenergic receptor
Synonyms:
ADRB1 adrenergic Beta1
Type:
Enzyme Catalytic Domain
Mol. Mass.:
50540.48
Organism:
GUINEA PIG
Description:
adrenergic Beta1 ADRB1 GUINEA PIG::B0FL73
Residue:
467
  
Inhibitor
Name:
BDBM82504
Synonyms:
TMQ, 5-TrifluoroMe
Type:
Small organic molecule
Emp. Form.:
C20H22F3NO5
Mol. Mass.:
413.3876
SMILES:
COc1cc(CC2NCCc3c2cc(O)c(O)c3C(F)(F)F)cc(OC)c1OC
: