Target
Beta-2 adrenergic receptor
Ligand
BDBM82484
Substrate
Ki
1.09±n/a nM
Comments
PDSP_1871
Citation
 Fraundorfer, PFFertel, RHMiller, DDFeller, DR Biochemical and pharmacological characterization of high-affinity trimetoquinol analogs on guinea pig and human beta adrenergic receptor subtypes: evidence for partial agonism. J Pharmacol Exp Ther 270:665-74 (1994) Target
Name:
Beta-2 adrenergic receptor
Synonyms:
ADRB2_CAVPO adrenergic Beta2
Type:
Enzyme Catalytic Domain
Mol. Mass.:
46993.24
Organism:
GUINEA PIG
Description:
adrenergic Beta2 ADRB2 GUINEA PIG::Q8K4Z4
Residue:
418
  
Inhibitor
Name:
BDBM82484
Synonyms:
TMQ, 3'-Iodo
Type:
Small organic molecule
Emp. Form.:
C18H20INO4
Mol. Mass.:
441.2602
SMILES:
COc1cc(CC2NCCc3cc(O)c(O)cc23)cc(I)c1OC
: