Target
Beta-2 adrenergic receptor
Ligand
BDBM82497
Substrate
Ki
371.53±n/a nM
Comments
PDSP_1888
Citation
 Fraundorfer, PFFertel, RHMiller, DDFeller, DR Biochemical and pharmacological characterization of high-affinity trimetoquinol analogs on guinea pig and human beta adrenergic receptor subtypes: evidence for partial agonism. J Pharmacol Exp Ther 270:665-74 (1994) Target
Name:
Beta-2 adrenergic receptor
Synonyms:
ADRB2_CAVPO adrenergic Beta2
Type:
Enzyme Catalytic Domain
Mol. Mass.:
46993.24
Organism:
GUINEA PIG
Description:
adrenergic Beta2 ADRB2 GUINEA PIG::Q8K4Z4
Residue:
418
  
Inhibitor
Name:
BDBM82497
Synonyms:
TMQ, R-(-)-8-Fluoro
Type:
Small organic molecule
Emp. Form.:
C19H22FNO5
Mol. Mass.:
363.3801
SMILES:
COc1cc(C[C@H]2NCCc3cc(O)c(O)c(F)c23)cc(OC)c1OC
: