Target
Beta-2 adrenergic receptor
Ligand
BDBM50019355
Substrate
Ki
20.89±n/a nM
Comments
PDSP_1890
Citation
 Fraundorfer, PFFertel, RHMiller, DDFeller, DR Biochemical and pharmacological characterization of high-affinity trimetoquinol analogs on guinea pig and human beta adrenergic receptor subtypes: evidence for partial agonism. J Pharmacol Exp Ther 270:665-74 (1994) Target
Name:
Beta-2 adrenergic receptor
Synonyms:
ADRB2 ADRB2_HUMAN Beta-2 adrenoceptor | Beta-2 adrenoreceptor
Type:
Mol. Mass.:
46461.69
Organism:
Homo sapiens (Human)
Description:
P07550
Residue:
413
  
Inhibitor
Name:
BDBM50019355
Synonyms:
1-(3,4,5-Trimethoxy-benzyl)-1,2,3,4-tetrahydro-isoquinoline-6,7-diol CHEMBL299175 TMQ, Racemic | Tretoquinol
Type:
Small organic molecule
Emp. Form.:
C19H23NO5
Mol. Mass.:
345.3896
SMILES:
COc1cc(CC2NCCc3cc(O)c(O)cc23)cc(OC)c1OC
: