Target
Delta-type opioid receptor
Ligand
BDBM21865
Substrate
Ki
0.59±n/a nM
Comments
PDSP_676
Citation
 Standifer, KMCheng, JBrooks, AIHonrado, CPSu, WVisconti, LMBiedler, JLPasternak, GW Biochemical and pharmacological characterization of mu, delta and kappa 3 opioid receptors expressed in BE(2)-C neuroblastoma cells. J Pharmacol Exp Ther 270:1246-55 (1994) Target
Name:
Delta-type opioid receptor
Synonyms:
D-OR-1 Delta opioid receptor OPIATE Delta OPRD1 OPRK1 | opioid receptor, delta 1
Type:
G Protein-Coupled Receptor (GPCR)
Mol. Mass.:
40382.98
Organism:
Homo sapiens (Human)
Description:
Competition binding assays were carried out using membrane preparations from transfected HN9.10 cells that constitutively expressed the delta opioid receptor.
Residue:
372
  
Inhibitor
Name:
BDBM21865
Synonyms:
(14beta)-17-(cyclopropylmethyl)-18-(1-hydroxy-1-methylethyl)-6-methoxy-18,19-dihydro-4,5-epoxy-6,14-ethenomorphinan-3-ol CHEMBL24995 [3H]-diprenorphine
Type:
radiolabeled ligand
Emp. Form.:
C26H35NO4
Mol. Mass.:
425.5604
SMILES:
[H][C@]12Cc3ccc(O)c4OC5[C@](CCN1CC1CC1)(c34)[C@@]21CCC5(OC)C(C1)C(C)(C)O
: