Target
Melatonin receptor type 1A
Ligand
BDBM10755
Substrate
Ki
>10000±n/a nM
Comments
PDSP_150
Citation
 Reppert, SMWeaver, DREbisawa, T Cloning and characterization of a mammalian melatonin receptor that mediates reproductive and circadian responses. Neuron 13:1177-85 (1994)  
Target
Name:
Melatonin receptor type 1A
Synonyms:
MTNR1A Melatonin | Melatonin receptor type 1A
Type:
Enzyme Catalytic Domain
Mol. Mass.:
40421.02
Organism:
Sheep
Description:
Melatonin 0 Sheep::P48040
Residue:
366
  
Inhibitor
Name:
BDBM10755
Synonyms:
14C-5-hydroxy tryptamine creatinine disulfate 5-HT 5-hydroxy tryptamine creatinine disulfate Serotonin | [3H]-5-HT
Type:
Small organic molecule
Emp. Form.:
C10H12N2O
Mol. Mass.:
176.2151
SMILES:
NCCc1c[nH]c2ccc(O)cc12
: