Target
Hrh3 protein
Ligand
BDBM22911
Substrate
Ki
1±n/a nM
Comments
PDSP_968
Citation
 Ligneau, XGarbarg, MVizuete, MLDiaz, JPurand, KStark, HSchunack, WSchwartz, JC [125I]iodoproxyfan, a new antagonist to label and visualize cerebral histamine H3 receptors. J Pharmacol Exp Ther 271:452-9 (1994) Target
Name:
Hrh3 protein
Synonyms:
HISTAMINE H3 Hrh3 protein
Type:
Enzyme Catalytic Domain
Mol. Mass.:
37860.96
Organism:
RAT
Description:
Q5PPG3
Residue:
344
  
Inhibitor
Name:
BDBM22911
Synonyms:
2-(3H-imidazol-4-yl)ethylsulfanylmethanimidamide CHEMBL544911 {[2-(1H-imidazol-4-yl)ethyl]sulfanyl}methanimidamide
Type:
Small organic molecule
Emp. Form.:
C6H10N4S
Mol. Mass.:
170.235
SMILES:
NC(=N)SCCc1cnc[nH]1
: