Target
Alpha-2A adrenergic receptor
Ligand
BDBM35234
Substrate
Ki
371±n/a nM
Comments
PDSP_1348
Citation
 O'Rourke, MFIversen, LJLomasney, JWBylund, DB Species orthologs of the alpha-2A adrenergic receptor: the pharmacological properties of the bovine and rat receptors differ from the human and porcine receptors. J Pharmacol Exp Ther 271:735-40 (1994) Target
Name:
Alpha-2A adrenergic receptor
Synonyms:
Alpha-2A adrenergic receptor adrenergic Alpha2A
Type:
Enzyme Catalytic Domain
Mol. Mass.:
48998.96
Organism:
PIG
Description:
adrenergic Alpha2 0 PIG::P18871
Residue:
450
  
Inhibitor
Name:
BDBM35234
Synonyms:
DL-[7-3H]norepinephrine Noradrenaline,(+) | [3H]NE
Type:
radiolabeled ligand
Emp. Form.:
C8H11NO3
Mol. Mass.:
169.1778
SMILES:
NCC(O)c1ccc(O)c(O)c1
: