Target
5-hydroxytryptamine receptor 1A
Ligand
BDBM50005127
Substrate
Ki
3.89±n/a nM
Comments
PDSP_985
Citation
 Boess, FGMartin, IL Molecular biology of 5-HT receptors. Neuropharmacology 33:275-317 (1994)  
Target
Name:
5-hydroxytryptamine receptor 1A
Synonyms:
5-HT-1A 5-hydroxytryptamine receptor 1A (5-HT-1A) ADRB2RL1 Dopamine D2 receptor and serotonin 1a receptor HTR1A | Serotonin receptor 1A
Type:
Mol. Mass.:
46122.49
Organism:
Homo sapiens (Human)
Description:
Residue:
422
  
Inhibitor
Name:
BDBM50005127
Synonyms:
1,1-Dioxo-2-[4-(4-pyrimidin-2-yl-piperazin-1-yl)-butyl]-1,2-dihydro-1lambda*6*-benzo[d]isothiazol-3-one 1,1-Dioxo-2-[4-(4-pyrimidin-2-yl-piperazin-1-yl)-butyl]-1,2-dihydro-1lambda*6*-benzo[d]isothiazol-3-one(Ipsapirone) IPSAPIRONE
Type:
Small organic molecule
Emp. Form.:
C19H23N5O3S
Mol. Mass.:
401.483
SMILES:
O=C1N(CCCCN2CCN(CC2)c2ncccn2)S(=O)(=O)c2ccccc12
: