Target
5-hydroxytryptamine receptor 1A
Ligand
BDBM21395
Substrate
Ki
8912.5±n/a nM
Comments
PDSP_1014
Citation
 Boess, FGMartin, IL Molecular biology of 5-HT receptors. Neuropharmacology 33:275-317 (1994)  
Target
Name:
5-hydroxytryptamine receptor 1A
Synonyms:
5-HT-1A 5-hydroxytryptamine receptor 1A (5-HT-1A) ADRB2RL1 Dopamine D2 receptor and serotonin 1a receptor HTR1A | Serotonin receptor 1A
Type:
Mol. Mass.:
46122.49
Organism:
Homo sapiens (Human)
Description:
Residue:
422
  
Inhibitor
Name:
BDBM21395
Synonyms:
3-(2-(4-(4-Fluorobenzoyl)piperidinol)ethyl)-2,4(1H,3H)-quinazolinedione CHEMBL1628637 Ketanserin R-41-468 [3H]-Ketanserin
Type:
radiolabeled ligand
Emp. Form.:
C22H22FN3O3
Mol. Mass.:
395.4268
SMILES:
Fc1ccc(cc1)C(=O)C1CCN(CCn2c(=O)[nH]c3ccccc3c2=O)CC1
: