Target
5-hydroxytryptamine receptor 1D
Ligand
BDBM30707
Substrate
Ki
5.12±n/a nM
Comments
PDSP_694
Citation
 Boess, FGMartin, IL Molecular biology of 5-HT receptors. Neuropharmacology 33:275-317 (1994)  
Target
Name:
5-hydroxytryptamine receptor 1D
Synonyms:
5-HT1D 5HT1D_CANLF RDC4
Type:
Enzyme Catalytic Domain
Mol. Mass.:
41894.67
Organism:
Dog
Description:
5-HT1D HTR1D Dog::P11614
Residue:
377
  
Inhibitor
Name:
BDBM30707
Synonyms:
2-(5-methoxy-1H-indol-3-yl)-N,N-dimethyl-ethanamine 2-(5-methoxy-1H-indol-3-yl)ethyl-dimethyl-amine CHEMBL7257 Methoxydimethyltryptamines WO2023019367, Compound 5-MeO-DMT | cid_1832
Type:
Small organic molecule
Emp. Form.:
C13H18N2O
Mol. Mass.:
218.2948
SMILES:
COc1ccc2[nH]cc(CCN(C)C)c2c1
: