Target
5-hydroxytryptamine receptor 1D
Ligand
BDBM50007406
Substrate
Ki
112.2±n/a nM
Comments
PDSP_1808
Citation
 Boess, FGMartin, IL Molecular biology of 5-HT receptors. Neuropharmacology 33:275-317 (1994)  
Target
Name:
5-hydroxytryptamine receptor 1D
Synonyms:
5-HT1D 5HT1D_CANLF RDC4
Type:
Enzyme Catalytic Domain
Mol. Mass.:
41894.67
Organism:
Dog
Description:
5-HT1D HTR1D Dog::P11614
Residue:
377
  
Inhibitor
Name:
BDBM50007406
Synonyms:
1-(3-(trifluoromethyl)phenyl)piperazine 1-(3-Trifluoromethyl-phenyl)-piperazine(TFMPP) TFMPP
Type:
Small organic molecule
Emp. Form.:
C11H13F3N2
Mol. Mass.:
230.2295
SMILES:
FC(F)(F)c1cccc(c1)N1CCNCC1
: