Target
5-hydroxytryptamine receptor 5B
Ligand
BDBM50013515
Substrate
Ki
1000±n/a nM
Comments
PDSP_1987
Citation
 Boess, FGMartin, IL Molecular biology of 5-HT receptors. Neuropharmacology 33:275-317 (1994)  
Target
Name:
5-hydroxytryptamine receptor 5B
Synonyms:
5-HT5B 5HT5B_RAT Htr5b Serotonin 5b (5-HT5b) receptor
Type:
Enzyme Catalytic Domain
Mol. Mass.:
41141.95
Organism:
RAT
Description:
5-HT5B 0 RAT::P35365
Residue:
370
  
Inhibitor
Name:
BDBM50013515
Synonyms:
(+)-yohimbine 17alpha-hydroxyyohimban-16alpha-carboxylic acid methyl ester CORYNANTHINE Quebrachin YOHIMBINE CHLORIDE Yohimbine cid_8969 methyl 17alpha-hydroxyyohimban-16alpha-carboxylate yohimbic acid methyl ester
Type:
Small organic molecule
Emp. Form.:
C21H26N2O3
Mol. Mass.:
354.4427
SMILES:
COC(=O)[C@H]1[C@@H](O)CC[C@H]2CN3CCc4c([nH]c5ccccc45)[C@@H]3C[C@H]12
: