Target
Alpha-2C adrenergic receptor
Ligand
BDBM81772
Substrate
Ki
31.8±n/a nM
Comments
PDSP_327
Citation
 Uhlén, SPorter, ACNeubig, RR The novel alpha-2 adrenergic radioligand [3H]-MK912 is alpha-2C selective among human alpha-2A, alpha-2B and alpha-2C adrenoceptors. J Pharmacol Exp Ther 271:1558-65 (1994) Target
Name:
Alpha-2C adrenergic receptor
Synonyms:
ADA2C_HUMAN ADRA2L2 Adrenergic alpha2C Adrenergic receptor alpha Alpha-2 adrenergic receptor subtype C4 Alpha-2C adrenoreceptor | adrenergic, alpha-2C-, receptor [Homo sapiens]
Type:
Enzyme
Mol. Mass.:
49552.32
Organism:
Homo sapiens (Human)
Description:
P18825
Residue:
462
  
Inhibitor
Name:
BDBM81772
Synonyms:
ARC-239 NSC_122211
Type:
Small organic molecule
Emp. Form.:
C25H30N2O3
Mol. Mass.:
406.5173
SMILES:
COc1ccccc1N1CCN(CCC2C(=O)c3ccccc3C(C)(C)C2=O)CC1
: