Target
Adenosine receptor A1
Ligand
BDBM50028567
Substrate
Ki
42700±n/a nM
Comments
PDSP_2586
Citation
 van Galen, PJvan Bergen, AHGallo-Rodriguez, CMelman, NOlah, MEIJzerman, APStiles, GLJacobson, KA A binding site model and structure-activity relationships for the rat A3 adenosine receptor. Mol Pharmacol 45:1101-11 (1994) Target
Name:
Adenosine receptor A1
Synonyms:
AA1R_RAT ADENOSINE A1 high Adenosine A1 receptor (A1) Adenosine receptors A1 | Adora1
Type:
Protein
Mol. Mass.:
36704.13
Organism:
Rattus norvegicus (rat)
Description:
Residue:
326
  
Inhibitor
Name:
BDBM50028567
Synonyms:
2-Aminomethyl-5-(6-amino-purin-9-yl)-tetrahydro-furan-3,4-diol | 5'-Deoxy-5'-aminoadenosine
Type:
Small organic molecule
Emp. Form.:
C10H14N6O3
Mol. Mass.:
266.2566
SMILES:
NCC1OC(C(O)C1O)n1cnc2c(N)ncnc12
: