Target
Adenosine receptor A1
Ligand
BDBM82522
Substrate
Ki
>10000±n/a nM
Comments
PDSP_2574
Citation
 van Galen, PJvan Bergen, AHGallo-Rodriguez, CMelman, NOlah, MEIJzerman, APStiles, GLJacobson, KA A binding site model and structure-activity relationships for the rat A3 adenosine receptor. Mol Pharmacol 45:1101-11 (1994) Target
Name:
Adenosine receptor A1
Synonyms:
AA1R_RAT ADENOSINE A1 high Adenosine A1 receptor (A1) Adenosine receptors A1 | Adora1
Type:
Protein
Mol. Mass.:
36704.13
Organism:
Rattus norvegicus (rat)
Description:
Residue:
326
  
Inhibitor
Name:
BDBM82522
Synonyms:
7-MethylX CAS_552-62-5 | CHEMBL321248
Type:
Small organic molecule
Emp. Form.:
C6H6N4O2
Mol. Mass.:
166.1374
SMILES:
Cn1cnc2[nH]c(=O)[nH]c(=O)c12
: