Target
Adenosine receptor A1
Ligand
BDBM82539
Substrate
Ki
>10000±n/a nM
Comments
PDSP_2562
Citation
 van Galen, PJvan Bergen, AHGallo-Rodriguez, CMelman, NOlah, MEIJzerman, APStiles, GLJacobson, KA A binding site model and structure-activity relationships for the rat A3 adenosine receptor. Mol Pharmacol 45:1101-11 (1994) Target
Name:
Adenosine receptor A1
Synonyms:
AA1R_RAT ADENOSINE A1 high Adenosine A1 receptor (A1) Adenosine receptors A1 | Adora1
Type:
Protein
Mol. Mass.:
36704.13
Organism:
Rattus norvegicus (rat)
Description:
Residue:
326
  
Inhibitor
Name:
BDBM82539
Synonyms:
beta-D-Psicofuranosyladenine
Type:
Small organic molecule
Emp. Form.:
C11H15N5O5
Mol. Mass.:
297.2673
SMILES:
Nc1ncnc2n(cnc12)[C@@]1(CO)O[C@H](CO)[C@@H](O)[C@H]1O
: