Target
Adenosine receptor A1
Ligand
BDBM82528
Substrate
Ki
87.3±n/a nM
Comments
PDSP_2589
Citation
 van Galen, PJvan Bergen, AHGallo-Rodriguez, CMelman, NOlah, MEIJzerman, APStiles, GLJacobson, KA A binding site model and structure-activity relationships for the rat A3 adenosine receptor. Mol Pharmacol 45:1101-11 (1994) Target
Name:
Adenosine receptor A1
Synonyms:
AA1R_RAT ADENOSINE A1 high Adenosine A1 receptor (A1) Adenosine receptors A1 | Adora1
Type:
Protein
Mol. Mass.:
36704.13
Organism:
Rattus norvegicus (rat)
Description:
Residue:
326
  
Inhibitor
Name:
BDBM82528
Synonyms:
N6-BenzylNECA
Type:
Small organic molecule
Emp. Form.:
C20H24N6O5
Mol. Mass.:
428.4418
SMILES:
CCNC(=O)OC[C@H]1OC([C@H](O)[C@@H]1O)n1cnc2c(NCc3ccccc3)ncnc12
: