Target
Adenosine receptor A1
Ligand
BDBM50096295
Substrate
Ki
>10000±n/a nM
Comments
PDSP_2564
Citation
 van Galen, PJvan Bergen, AHGallo-Rodriguez, CMelman, NOlah, MEIJzerman, APStiles, GLJacobson, KA A binding site model and structure-activity relationships for the rat A3 adenosine receptor. Mol Pharmacol 45:1101-11 (1994) Target
Name:
Adenosine receptor A1
Synonyms:
AA1R_RAT ADENOSINE A1 high Adenosine A1 receptor (A1) Adenosine receptors A1 | Adora1
Type:
Protein
Mol. Mass.:
36704.13
Organism:
Rattus norvegicus (rat)
Description:
Residue:
326
  
Inhibitor
Name:
BDBM50096295
Synonyms:
Uridine hydrogen ({[5-(2,4-dioxo-1,2,3,4-tetrahydropyrimidin-1-yl)-3,4-dihydroxyoxolan-2-yl]methyl phosphonato}oxy)phosphonate
Type:
Small organic molecule
Emp. Form.:
C9H12N2O12P2
Mol. Mass.:
402.1464
SMILES:
OC1C(O)C(OC1COP([O-])(=O)OP(O)([O-])=O)n1ccc(=O)[nH]c1=O
: